Information card for entry 7225697
Formula | C29 H23 Cl5 N2 O10 |
Calculated formula | C29 H23 Cl5 N2 O10 |
Title of publication | High resolution X-ray and neutron diffraction studies on molecular complexes of chloranilic acid and lutidines |
Authors of publication | Sovago, Ioana; Thomas, Lynne H.; Adam, Martin S.; Capelli, Silvia C.; Wilson, Chick C.; Farrugia, Louis J. |
Journal of publication | CrystEngComm |
Year of publication | 2016 |
Journal volume | 18 |
Journal issue | 30 |
Pages of publication | 5697 |
a | 8.4477 ± 0.0003 Å |
b | 10.5046 ± 0.0003 Å |
c | 18.2834 ± 0.0004 Å |
α | 99.084 ± 0.0016° |
β | 93.6611 ± 0.0017° |
γ | 91.1015 ± 0.0012° |
Cell volume | 1598.14 ± 0.08 Å3 |
Cell temperature | 100 ± 2 K |
Ambient diffraction temperature | 100 ± 2 K |
Number of distinct elements | 5 |
Space group number | 2 |
Hermann-Mauguin space group symbol | P -1 |
Hall space group symbol | -P 1 |
Residual factor for all reflections | 0.0583 |
Residual factor for significantly intense reflections | 0.0336 |
Weighted residual factors for significantly intense reflections | 0.0816 |
Weighted residual factors for all reflections included in the refinement | 0.0863 |
Goodness-of-fit parameter for all reflections included in the refinement | 1.05 |
Diffraction radiation probe | x-ray |
Diffraction radiation wavelength | 0.71073 Å |
Diffraction radiation type | MoKα |