Information card for entry 7225708
Chemical name | 2-(1,5,3-dithiazepan-3-yl)acetic acid |
Formula | C6 H13 N O3 S2 |
Calculated formula | C6 H13 N O3 S2 |
SMILES | S1CN(CC(=O)O)CSCC1.O |
Title of publication | Intermolecular interactions and chiral crystallization effects in (1,5,3-dithiazepan-3-yl)-alkanoic acids |
Authors of publication | Tulyabaev, Arthur R.; Mescheryakova, Ekaterina S.; Khabibullina, Guzel R.; Khalilov, Leonard M. |
Journal of publication | CrystEngComm |
Year of publication | 2016 |
Journal volume | 18 |
Journal issue | 30 |
Pages of publication | 5686 |
a | 6.6882 ± 0.0003 Å |
b | 8.6039 ± 0.0004 Å |
c | 8.0793 ± 0.0004 Å |
α | 90° |
β | 94.507 ± 0.005° |
γ | 90° |
Cell volume | 463.48 ± 0.04 Å3 |
Cell temperature | 200 ± 2 K |
Ambient diffraction temperature | 200 ± 2 K |
Number of distinct elements | 5 |
Space group number | 4 |
Hermann-Mauguin space group symbol | P 1 21 1 |
Hall space group symbol | P 2yb |
Residual factor for all reflections | 0.0313 |
Residual factor for significantly intense reflections | 0.0303 |
Weighted residual factors for significantly intense reflections | 0.0865 |
Weighted residual factors for all reflections included in the refinement | 0.0888 |
Goodness-of-fit parameter for all reflections included in the refinement | 0.853 |
Diffraction radiation wavelength | 0.71073 Å |