Information card for entry 7225712
Chemical name | Bis(diisobutylammonium) octabromodiantimonate(III) |
Formula | C8 H20 Br4 N Sb |
Calculated formula | C8.018 H20.054 Br4 N Sb |
Title of publication | Enormous lattice distortion through an isomorphous phase transition in an organic‒inorganic hybrid based on haloantimonate(iii) |
Authors of publication | Wojciechowska, Martyna; Szklarz, Przemysław; Białońska, Agata; Baran, Jan; Janicki, Rafał; Medycki, Wojciech; Durlak, Piotr; Piecha-Bisiorek, Anna; Jakubas, Ryszard |
Journal of publication | CrystEngComm |
Year of publication | 2016 |
Journal volume | 18 |
Journal issue | 33 |
Pages of publication | 6184 |
a | 5.964 ± 0.002 Å |
b | 20.098 ± 0.008 Å |
c | 14.385 ± 0.008 Å |
α | 90° |
β | 99.25 ± 0.05° |
γ | 90° |
Cell volume | 1701.8 ± 1.3 Å3 |
Cell temperature | 250 ± 2 K |
Ambient diffraction temperature | 250 ± 2 K |
Number of distinct elements | 5 |
Space group number | 14 |
Hermann-Mauguin space group symbol | P 1 21/c 1 |
Hall space group symbol | -P 2ybc |
Residual factor for all reflections | 0.0663 |
Residual factor for significantly intense reflections | 0.046 |
Weighted residual factors for significantly intense reflections | 0.1133 |
Weighted residual factors for all reflections included in the refinement | 0.121 |
Goodness-of-fit parameter for all reflections included in the refinement | 0.915 |
Diffraction radiation wavelength | 0.71073 Å |
Diffraction radiation type | MoKα |