Information card for entry 7225714
Chemical name | Bis(diisobutylammonium) octachlorodiantimonate(III) |
Formula | C8 H20 Cl4 N Sb |
Calculated formula | C8 H20 Cl4 N Sb |
Title of publication | Enormous lattice distortion through an isomorphous phase transition in an organic‒inorganic hybrid based on haloantimonate(iii) |
Authors of publication | Wojciechowska, Martyna; Szklarz, Przemysław; Białońska, Agata; Baran, Jan; Janicki, Rafał; Medycki, Wojciech; Durlak, Piotr; Piecha-Bisiorek, Anna; Jakubas, Ryszard |
Journal of publication | CrystEngComm |
Year of publication | 2016 |
Journal volume | 18 |
Journal issue | 33 |
Pages of publication | 6184 |
a | 5.79 ± 0.002 Å |
b | 19.485 ± 0.003 Å |
c | 14.275 ± 0.003 Å |
α | 90° |
β | 101.28 ± 0.03° |
γ | 90° |
Cell volume | 1579.4 ± 0.7 Å3 |
Cell temperature | 250 ± 2 K |
Ambient diffraction temperature | 250 ± 2 K |
Number of distinct elements | 5 |
Space group number | 14 |
Hermann-Mauguin space group symbol | P 1 21/c 1 |
Hall space group symbol | -P 2ybc |
Residual factor for all reflections | 0.0728 |
Residual factor for significantly intense reflections | 0.0343 |
Weighted residual factors for significantly intense reflections | 0.0589 |
Weighted residual factors for all reflections included in the refinement | 0.0645 |
Goodness-of-fit parameter for all reflections included in the refinement | 0.822 |
Diffraction radiation wavelength | 0.71073 Å |
Diffraction radiation type | MoKα |