Information card for entry 7225723
Formula | C36 H38 Co2 N12 O42 W12 |
Calculated formula | C36 H30 Co2 N12 O40 W12 |
Title of publication | The factors affecting the assembly of Keggin‒metal‒bimb systems: charge/polarity of Keggin polyanions and coordination modes of metal cations |
Authors of publication | Zhao, Chunyan; Li, Shaobin; Ma, Huiyuan; Zhang, Chunjing; Pang, Haijun; Yu, Yan; Zhang, Zhuanfang |
Journal of publication | CrystEngComm |
Year of publication | 2016 |
Journal volume | 18 |
Journal issue | 33 |
Pages of publication | 6233 |
a | 26.548 ± 0.005 Å |
b | 20.076 ± 0.005 Å |
c | 12.964 ± 0.005 Å |
α | 90 ± 0.005° |
β | 90 ± 0.005° |
γ | 90 ± 0.005° |
Cell volume | 6910 ± 3 Å3 |
Cell temperature | 293 ± 2 K |
Ambient diffraction temperature | 293 ± 2 K |
Number of distinct elements | 6 |
Space group number | 62 |
Hermann-Mauguin space group symbol | P n m a |
Hall space group symbol | -P 2ac 2n |
Residual factor for all reflections | 0.0804 |
Residual factor for significantly intense reflections | 0.0576 |
Weighted residual factors for significantly intense reflections | 0.147 |
Weighted residual factors for all reflections included in the refinement | 0.1613 |
Goodness-of-fit parameter for all reflections included in the refinement | 1.057 |
Diffraction radiation wavelength | 0.71069 Å |
Diffraction radiation type | MoKα |