Information card for entry 7225725
Formula | C36 H41 Ag2 B N12 O42 W12 |
Calculated formula | C36 H30 Ag2 B N12 O41 W12 |
Title of publication | The factors affecting the assembly of Keggin‒metal‒bimb systems: charge/polarity of Keggin polyanions and coordination modes of metal cations |
Authors of publication | Zhao, Chunyan; Li, Shaobin; Ma, Huiyuan; Zhang, Chunjing; Pang, Haijun; Yu, Yan; Zhang, Zhuanfang |
Journal of publication | CrystEngComm |
Year of publication | 2016 |
Journal volume | 18 |
Journal issue | 33 |
Pages of publication | 6233 |
a | 26.664 ± 0.005 Å |
b | 20.022 ± 0.005 Å |
c | 12.937 ± 0.005 Å |
α | 90 ± 0.005° |
β | 90 ± 0.005° |
γ | 90 ± 0.005° |
Cell volume | 6907 ± 3 Å3 |
Cell temperature | 293 ± 2 K |
Ambient diffraction temperature | 293 ± 2 K |
Number of distinct elements | 7 |
Space group number | 62 |
Hermann-Mauguin space group symbol | P n m a |
Hall space group symbol | -P 2ac 2n |
Residual factor for all reflections | 0.103 |
Residual factor for significantly intense reflections | 0.0702 |
Weighted residual factors for significantly intense reflections | 0.176 |
Weighted residual factors for all reflections included in the refinement | 0.1995 |
Goodness-of-fit parameter for all reflections included in the refinement | 0.834 |
Diffraction radiation wavelength | 0.71069 Å |
Diffraction radiation type | MoKα |