Information card for entry 7225731
Formula | C8 H18 B Br F4 N2 O |
Calculated formula | C8 H18 B Br F4 N2 O |
SMILES | [B](F)(F)(F)[F-].BrCC[N+]12CCN(CC1)CC2.O |
Title of publication | Water motion-controlled reversible phase transition and de/absorption-controlled reversible phase transformation in the hydrate crystal (BEDABCO)ClO4·H2O and its analogs |
Authors of publication | Han, Xiang-Bin; Xiao, Jing-Mei |
Journal of publication | CrystEngComm |
Year of publication | 2016 |
Journal volume | 18 |
Journal issue | 33 |
Pages of publication | 6195 |
a | 10.886 ± 0.002 Å |
b | 10.237 ± 0.002 Å |
c | 11.376 ± 0.002 Å |
α | 90° |
β | 94.16 ± 0.03° |
γ | 90° |
Cell volume | 1264.4 ± 0.4 Å3 |
Cell temperature | 293 ± 2 K |
Ambient diffraction temperature | 293 ± 2 K |
Number of distinct elements | 7 |
Space group number | 14 |
Hermann-Mauguin space group symbol | P 1 21/c 1 |
Hall space group symbol | -P 2ybc |
Residual factor for all reflections | 0.0984 |
Residual factor for significantly intense reflections | 0.0649 |
Weighted residual factors for significantly intense reflections | 0.1464 |
Weighted residual factors for all reflections included in the refinement | 0.1692 |
Goodness-of-fit parameter for all reflections included in the refinement | 0.967 |
Diffraction radiation wavelength | 0.71073 Å |
Diffraction radiation type | MoKα |