Information card for entry 7225808
Formula | C27 H21 Cu I0 N4 O9 |
Calculated formula | C27 H22 Cu N4 O9 |
Title of publication | Effect of noncovalent interactions on Ag(i)/Cu(ii) supramolecular architecture for dual-functional luminescence and semiconductive properties |
Authors of publication | Song, Yang; Fan, Ruiqing; Du, Xi; Xing, Kai; Wang, Ping; Dong, Yuwei; Yang, Yulin |
Journal of publication | CrystEngComm |
Year of publication | 2016 |
Journal volume | 18 |
Journal issue | 34 |
Pages of publication | 6411 |
a | 10.0949 ± 0.0007 Å |
b | 24.2027 ± 0.0015 Å |
c | 10.3445 ± 0.0008 Å |
α | 90° |
β | 97.76 ± 0.003° |
γ | 90° |
Cell volume | 2504.3 ± 0.3 Å3 |
Cell temperature | 173 ± 2 K |
Ambient diffraction temperature | 173 ± 2 K |
Number of distinct elements | 6 |
Space group number | 14 |
Hermann-Mauguin space group symbol | P 1 21/c 1 |
Hall space group symbol | -P 2ybc |
Residual factor for all reflections | 0.0949 |
Residual factor for significantly intense reflections | 0.0512 |
Weighted residual factors for significantly intense reflections | 0.1283 |
Weighted residual factors for all reflections included in the refinement | 0.1528 |
Goodness-of-fit parameter for all reflections included in the refinement | 0.941 |
Diffraction radiation wavelength | 0.71073 Å |
Diffraction radiation type | MoKα |