Information card for entry 7225842
Common name | ortho-ethoxy-trans-cinnamic acid and 2,2'-diethoxy alpha-truxillic acid |
Chemical name | (E)-3-(2-Ethoxyphenyl)propenoic acid and trans-2,4-bis(2-ethoxyphenyl)-trans-1,3-cyclobutane-dicarboxylic acid |
Formula | C33 H36 O9 |
Calculated formula | C33 H36 O9 |
Title of publication | Photodimerisation of the α′-polymorph of ortho-ethoxy-trans-cinnamic acid occurs via a two-stage mechanism at 343 K yielding 100% α-truxillic acid |
Authors of publication | Fernandes, M. A.; Levendis, D. C. |
Journal of publication | CrystEngComm |
Year of publication | 2016 |
Journal volume | 18 |
Journal issue | 38 |
Pages of publication | 7363 |
a | 8.435 ± 0.006 Å |
b | 11.431 ± 0.008 Å |
c | 17.048 ± 0.012 Å |
α | 105.141 ± 0.014° |
β | 92.907 ± 0.018° |
γ | 104.043 ± 0.016° |
Cell volume | 1527.8 ± 1.9 Å3 |
Cell temperature | 293 ± 2 K |
Ambient diffraction temperature | 293 ± 2 K |
Number of distinct elements | 3 |
Space group number | 2 |
Hermann-Mauguin space group symbol | P -1 |
Hall space group symbol | -P 1 |
Residual factor for all reflections | 0.367 |
Residual factor for significantly intense reflections | 0.1381 |
Weighted residual factors for significantly intense reflections | 0.301 |
Weighted residual factors for all reflections included in the refinement | 0.4215 |
Goodness-of-fit parameter for all reflections included in the refinement | 0.912 |
Diffraction radiation wavelength | 0.71073 Å |
Diffraction radiation type | MoKα |