Information card for entry 7225848
Common name | ortho-ethoxy-trans-cinnamic acid and 2,2'-diethoxy alpha-truxillic acid |
Chemical name | (E)-3-(2-Ethoxyphenyl)propenoic acid and trans-2,4-bis(2-ethoxyphenyl)-trans-1,3-cyclobutane-dicarboxylic acid |
Formula | C33 H36 O9 |
Calculated formula | C33 H36 O9 |
Title of publication | Photodimerisation of the α′-polymorph of ortho-ethoxy-trans-cinnamic acid occurs via a two-stage mechanism at 343 K yielding 100% α-truxillic acid |
Authors of publication | Fernandes, M. A.; Levendis, D. C. |
Journal of publication | CrystEngComm |
Year of publication | 2016 |
Journal volume | 18 |
Journal issue | 38 |
Pages of publication | 7363 |
a | 8.3738 ± 0.0014 Å |
b | 11.2351 ± 0.0019 Å |
c | 17.064 ± 0.003 Å |
α | 106.059 ± 0.003° |
β | 92.617 ± 0.004° |
γ | 104.502 ± 0.003° |
Cell volume | 1482.1 ± 0.4 Å3 |
Cell temperature | 173 ± 2 K |
Ambient diffraction temperature | 173 ± 2 K |
Number of distinct elements | 3 |
Space group number | 2 |
Hermann-Mauguin space group symbol | P -1 |
Hall space group symbol | -P 1 |
Residual factor for all reflections | 0.1333 |
Residual factor for significantly intense reflections | 0.0591 |
Weighted residual factors for significantly intense reflections | 0.1459 |
Weighted residual factors for all reflections included in the refinement | 0.1771 |
Goodness-of-fit parameter for all reflections included in the refinement | 0.982 |
Diffraction radiation wavelength | 0.71073 Å |
Diffraction radiation type | MoKα |