Information card for entry 7225875
Formula
C28 H24 Cl4 Hg3 N4
Calculated formula
C28 H24 Cl4 Hg3 N4
Title of publication
A facile, fast responsive and highly selective mercury (II) probe: characterized by the fluorescence quenching of 2,9-dimethyl-1,10-phenanthroline and two new metal-organic frameworks
Authors of publication
Shan, Fa-Shuo; Lai, Jia-Ping; Sun, Hui; Zhang, Ping; Luo, Chong; He, Yan-Hui; Feng, Huan-Ran
Journal of publication
RSC Adv.
Year of publication
2016
a
10.435 ± 0.002 Å
b
16.024 ± 0.003 Å
c
17.348 ± 0.003 Å
α
90°
β
94.861 ± 0.003°
γ
90°
Cell volume
2890.3 ± 0.9 Å3
Cell temperature
296 ± 2 K
Ambient diffraction temperature
296 ± 2 K
Number of distinct elements
5
Space group number
15
Hermann-Mauguin space group symbol
C 1 2/c 1
Hall space group symbol
-C 2yc
Residual factor for all reflections
0.0511
Residual factor for significantly intense reflections
0.0349
Weighted residual factors for significantly intense reflections
0.0857
Weighted residual factors for all reflections included in the refinement
0.0915
Goodness-of-fit parameter for all reflections included in the refinement
1.014
Diffraction radiation wavelength
0.71073 Å
Diffraction radiation type
MoKα
Yes
No
No