Information card for entry 7225878
Formula | C28 H48 B K N4 O74 Sm4 W12 |
Calculated formula | C28 H48 B K N4 O74 Sm4 W12 |
Title of publication | Structural scope of six new layered to pillar-layered hybrid inorganic‒organic networks bearing [BW12O40]5−and lanthanoid-cluster; database study toward ligand role in assemblies |
Authors of publication | Najafi, Atefeh; Mirzaei, Masoud; Mague, Joel T. |
Journal of publication | CrystEngComm |
Year of publication | 2016 |
Journal volume | 18 |
Journal issue | 35 |
Pages of publication | 6724 |
a | 30.27 ± 0.003 Å |
b | 15.5104 ± 0.0013 Å |
c | 21.842 ± 0.003 Å |
α | 90° |
β | 132.839 ± 0.001° |
γ | 90° |
Cell volume | 7519.5 ± 1.4 Å3 |
Cell temperature | 150 ± 2 K |
Ambient diffraction temperature | 150 ± 2 K |
Number of distinct elements | 8 |
Space group number | 9 |
Hermann-Mauguin space group symbol | C 1 c 1 |
Hall space group symbol | C -2yc |
Residual factor for all reflections | 0.0703 |
Residual factor for significantly intense reflections | 0.0647 |
Weighted residual factors for significantly intense reflections | 0.1336 |
Weighted residual factors for all reflections included in the refinement | 0.1375 |
Goodness-of-fit parameter for all reflections included in the refinement | 1.089 |
Diffraction radiation wavelength | 0.71073 Å |
Diffraction radiation type | MoKα |