Information card for entry 7225933
Formula | C15 H19 La N8 O10 |
Calculated formula | C15 H19 La N8 O10 |
SMILES | [La]12345([n]6c(cc(C)[nH]6)c6cccc(c7cc(C)[nH][n]27)[n]16)(ON(=[O]3)=O)(ON(=[O]4)=O)(ON(=[O]5)=O)[OH]CC |
Title of publication | Optical detection small biomolecule thiamines of micromolar level by highly luminescent lanthanide complexes with tridentate N-heterocyclic ligand |
Authors of publication | Du, Ning; Gao, Xue; Song, Jian; Wang, Zhi Nan; Xing, Yong Heng; Bai, Fengying; Shi, Zhan |
Journal of publication | RSC Adv. |
Year of publication | 2016 |
a | 9.84 ± 0.0006 Å |
b | 10.5881 ± 0.0006 Å |
c | 11.9083 ± 0.0007 Å |
α | 101.314 ± 0.001° |
β | 111.176 ± 0.001° |
γ | 93.081 ± 0.001° |
Cell volume | 1123.84 ± 0.11 Å3 |
Cell temperature | 296 ± 2 K |
Ambient diffraction temperature | 296 ± 2 K |
Number of distinct elements | 5 |
Space group number | 2 |
Hermann-Mauguin space group symbol | P -1 |
Hall space group symbol | -P 1 |
Residual factor for all reflections | 0.0379 |
Residual factor for significantly intense reflections | 0.0309 |
Weighted residual factors for significantly intense reflections | 0.0646 |
Weighted residual factors for all reflections included in the refinement | 0.0682 |
Goodness-of-fit parameter for all reflections included in the refinement | 1.032 |
Diffraction radiation wavelength | 0.71073 Å |
Diffraction radiation type | MoKα |