Information card for entry 7225936
Formula | C15 H19 N8 Nd O10 |
Calculated formula | C15 H19 N8 Nd O10 |
SMILES | [Nd]12345([n]6c(cc(C)[nH]6)c6cccc(c7cc(C)[nH][n]27)[n]16)(ON(=[O]3)=O)(ON(=[O]4)=O)(ON(=[O]5)=O)[OH]CC |
Title of publication | Optical detection small biomolecule thiamines of micromolar level by highly luminescent lanthanide complexes with tridentate N-heterocyclic ligand |
Authors of publication | Du, Ning; Gao, Xue; Song, Jian; Wang, Zhi Nan; Xing, Yong Heng; Bai, Fengying; Shi, Zhan |
Journal of publication | RSC Adv. |
Year of publication | 2016 |
a | 9.847 ± 0.003 Å |
b | 10.559 ± 0.003 Å |
c | 11.81 ± 0.004 Å |
α | 100.957 ± 0.005° |
β | 111.374 ± 0.004° |
γ | 93.104 ± 0.005° |
Cell volume | 1112.4 ± 0.6 Å3 |
Cell temperature | 296 ± 2 K |
Ambient diffraction temperature | 296 ± 2 K |
Number of distinct elements | 5 |
Space group number | 2 |
Hermann-Mauguin space group symbol | P -1 |
Hall space group symbol | -P 1 |
Residual factor for all reflections | 0.03 |
Residual factor for significantly intense reflections | 0.0244 |
Weighted residual factors for significantly intense reflections | 0.0544 |
Weighted residual factors for all reflections included in the refinement | 0.0558 |
Goodness-of-fit parameter for all reflections included in the refinement | 1 |
Diffraction radiation wavelength | 0.71073 Å |
Diffraction radiation type | MoKα |