Information card for entry 7225944
Formula | C9 H11 Br N2 |
Calculated formula | C9 H11 Br N2 |
SMILES | [Br-].[n+]1(CC#C)c(N)cc(cc1)C |
Title of publication | Rapid, metal-free and aqueous synthesis of imidazo[1,2-a]pyridine under ambient conditions |
Authors of publication | Chapman, Michael R.; Kwan, Maria H. T.; King, Georgina E.; Kyffin, Benjamin A.; Blacker, A. John; Willans, Charlotte E.; Nguyen, Bao N. |
Journal of publication | Green Chem. |
Year of publication | 2016 |
Journal volume | 18 |
Journal issue | 17 |
Pages of publication | 4623 |
a | 16.7925 ± 0.0007 Å |
b | 8.3062 ± 0.0004 Å |
c | 15.0809 ± 0.0007 Å |
α | 90° |
β | 108.294 ± 0.005° |
γ | 90° |
Cell volume | 1997.2 ± 0.17 Å3 |
Cell temperature | 120.01 ± 0.1 K |
Ambient diffraction temperature | 120.01 ± 0.1 K |
Number of distinct elements | 4 |
Space group number | 15 |
Hermann-Mauguin space group symbol | C 1 2/c 1 |
Hall space group symbol | -C 2yc |
Residual factor for all reflections | 0.0623 |
Residual factor for significantly intense reflections | 0.0442 |
Weighted residual factors for significantly intense reflections | 0.0869 |
Weighted residual factors for all reflections included in the refinement | 0.0961 |
Goodness-of-fit parameter for all reflections included in the refinement | 1.071 |
Diffraction radiation wavelength | 0.71073 Å |
Diffraction radiation type | MoKα |