Information card for entry 7226082
Formula | C24 H36 Ag2 B2 F8 N18 |
Calculated formula | C24 H36 Ag2 B2 F8 N18 |
Title of publication | Hydrothermal synthesis and characterization of a series of luminescent Ag(i) coordination polymers with two new multidentate bis-(1,2,3-triazole) ligands: structural diversity, polymorphism and photoluminescent sensing |
Authors of publication | Huo, Jian Zhong; Su, Xiu Mei; Wu, Xiang Xia; Liu, Yuan Yuan; Ding, Bin |
Journal of publication | CrystEngComm |
Year of publication | 2016 |
Journal volume | 18 |
Journal issue | 35 |
Pages of publication | 6640 |
a | 9.4022 ± 0.0005 Å |
b | 9.0007 ± 0.0006 Å |
c | 21.7341 ± 0.0012 Å |
α | 90° |
β | 95.977 ± 0.005° |
γ | 90° |
Cell volume | 1829.28 ± 0.19 Å3 |
Cell temperature | 100 ± 0.1 K |
Ambient diffraction temperature | 100 ± 0.1 K |
Number of distinct elements | 6 |
Space group number | 14 |
Hermann-Mauguin space group symbol | P 1 21/c 1 |
Hall space group symbol | -P 2ybc |
Residual factor for all reflections | 0.0856 |
Residual factor for significantly intense reflections | 0.0769 |
Weighted residual factors for significantly intense reflections | 0.2059 |
Weighted residual factors for all reflections included in the refinement | 0.2168 |
Goodness-of-fit parameter for all reflections included in the refinement | 1.074 |
Diffraction radiation probe | x-ray |
Diffraction radiation wavelength | 1.54184 Å |
Diffraction radiation type | CuKα |