Information card for entry 7226085
Formula | C24 H36 Ag2 B2 F8 N18 |
Calculated formula | C24 H36 Ag2 B2 F8 N18 |
Title of publication | Hydrothermal synthesis and characterization of a series of luminescent Ag(i) coordination polymers with two new multidentate bis-(1,2,3-triazole) ligands: structural diversity, polymorphism and photoluminescent sensing |
Authors of publication | Huo, Jian Zhong; Su, Xiu Mei; Wu, Xiang Xia; Liu, Yuan Yuan; Ding, Bin |
Journal of publication | CrystEngComm |
Year of publication | 2016 |
Journal volume | 18 |
Journal issue | 35 |
Pages of publication | 6640 |
a | 7.5701 ± 0.0003 Å |
b | 10.994 ± 0.0005 Å |
c | 12.2207 ± 0.0006 Å |
α | 110.593 ± 0.004° |
β | 98.841 ± 0.004° |
γ | 103.512 ± 0.004° |
Cell volume | 894.11 ± 0.08 Å3 |
Cell temperature | 293 ± 2 K |
Ambient diffraction temperature | 293 ± 2 K |
Number of distinct elements | 6 |
Space group number | 2 |
Hermann-Mauguin space group symbol | P -1 |
Hall space group symbol | -P 1 |
Residual factor for all reflections | 0.0742 |
Residual factor for significantly intense reflections | 0.0618 |
Weighted residual factors for significantly intense reflections | 0.1484 |
Weighted residual factors for all reflections included in the refinement | 0.1612 |
Goodness-of-fit parameter for all reflections included in the refinement | 1.029 |
Diffraction radiation wavelength | 0.71073 Å |
Diffraction radiation type | MoKα |