Information card for entry 7226096
Formula | C18 H17 Cd N4 O6 |
Calculated formula | C18 H17 Cd N4 O6 |
Title of publication | Structural diversity, luminescence and photocatalytic properties of six coordination polymers based on designed bifunctional 2-(imidazol-1-yl)terephthalic acid |
Authors of publication | Zhang, Xiutang; Fan, Liming; Fan, Weiliu; Li, Bin; Liu, Guangzeng; Liu, Xinzheng; Zhao, Xian |
Journal of publication | CrystEngComm |
Year of publication | 2016 |
Journal volume | 18 |
Journal issue | 36 |
Pages of publication | 6914 |
a | 29.9762 ± 0.0012 Å |
b | 6.7809 ± 0.0003 Å |
c | 21.3475 ± 0.0009 Å |
α | 90° |
β | 121.734 ± 0.001° |
γ | 90° |
Cell volume | 3690.5 ± 0.3 Å3 |
Cell temperature | 296 ± 2 K |
Ambient diffraction temperature | 296 ± 2 K |
Number of distinct elements | 5 |
Space group number | 15 |
Hermann-Mauguin space group symbol | C 1 2/c 1 |
Hall space group symbol | -C 2yc |
Residual factor for all reflections | 0.0288 |
Residual factor for significantly intense reflections | 0.0256 |
Weighted residual factors for significantly intense reflections | 0.0728 |
Weighted residual factors for all reflections included in the refinement | 0.0839 |
Goodness-of-fit parameter for all reflections included in the refinement | 1.067 |
Diffraction radiation wavelength | 0.71073 Å |
Diffraction radiation type | MoKα |