Information card for entry 7226126
Formula | C13 H11 I N2 O |
Calculated formula | C13 H11 I N2 O |
SMILES | Ic1c(NC(=O)Nc2ccccc2)cccc1 |
Title of publication | The impact of modular substitution on crystal packing: the tale of two ureas |
Authors of publication | Koshti, Vijay S.; Thorat, Shridhar H.; Gote, Ravindra P.; Chikkali, Samir H.; Gonnade, Rajesh G. |
Journal of publication | CrystEngComm |
Year of publication | 2016 |
Journal volume | 18 |
Journal issue | 37 |
Pages of publication | 7078 |
a | 21.0485 ± 0.0013 Å |
b | 4.6303 ± 0.0003 Å |
c | 12.8294 ± 0.0007 Å |
α | 90° |
β | 102.835 ± 0.004° |
γ | 90° |
Cell volume | 1219.12 ± 0.13 Å3 |
Cell temperature | 150 ± 2 K |
Ambient diffraction temperature | 150 ± 2 K |
Number of distinct elements | 5 |
Space group number | 14 |
Hermann-Mauguin space group symbol | P 1 21/c 1 |
Hall space group symbol | -P 2ybc |
Residual factor for all reflections | 0.0492 |
Residual factor for significantly intense reflections | 0.0411 |
Weighted residual factors for significantly intense reflections | 0.0691 |
Weighted residual factors for all reflections included in the refinement | 0.0713 |
Goodness-of-fit parameter for all reflections included in the refinement | 1.225 |
Diffraction radiation wavelength | 0.71073 Å |
Diffraction radiation type | MoKα |