Information card for entry 7226131
Formula | C13 H10 I N3 O2 S |
Calculated formula | C13 H10 I N3 O2 S |
SMILES | Ic1cc(NC(=S)Nc2ccc(N(=O)=O)cc2)ccc1 |
Title of publication | The impact of modular substitution on crystal packing: the tale of two ureas |
Authors of publication | Koshti, Vijay S.; Thorat, Shridhar H.; Gote, Ravindra P.; Chikkali, Samir H.; Gonnade, Rajesh G. |
Journal of publication | CrystEngComm |
Year of publication | 2016 |
Journal volume | 18 |
Journal issue | 37 |
Pages of publication | 7078 |
a | 14.2167 ± 0.0019 Å |
b | 14.5308 ± 0.0018 Å |
c | 6.8955 ± 0.001 Å |
α | 90° |
β | 90° |
γ | 90° |
Cell volume | 1424.5 ± 0.3 Å3 |
Cell temperature | 150 ± 2 K |
Ambient diffraction temperature | 150 ± 2 K |
Number of distinct elements | 6 |
Space group number | 33 |
Hermann-Mauguin space group symbol | P n a 21 |
Hall space group symbol | P 2c -2n |
Residual factor for all reflections | 0.0334 |
Residual factor for significantly intense reflections | 0.0316 |
Weighted residual factors for significantly intense reflections | 0.0701 |
Weighted residual factors for all reflections included in the refinement | 0.0709 |
Goodness-of-fit parameter for all reflections included in the refinement | 1.159 |
Diffraction radiation wavelength | 0.71073 Å |
Diffraction radiation type | MoKα |