Information card for entry 7226133
Formula | C13 H11 I N2 O |
Calculated formula | C13 H11 I N2 O |
SMILES | Ic1ccc(NC(=O)Nc2ccccc2)cc1 |
Title of publication | The impact of modular substitution on crystal packing: the tale of two ureas |
Authors of publication | Koshti, Vijay S.; Thorat, Shridhar H.; Gote, Ravindra P.; Chikkali, Samir H.; Gonnade, Rajesh G. |
Journal of publication | CrystEngComm |
Year of publication | 2016 |
Journal volume | 18 |
Journal issue | 37 |
Pages of publication | 7078 |
a | 26.18 ± 0.0017 Å |
b | 4.6273 ± 0.0003 Å |
c | 9.9779 ± 0.0007 Å |
α | 90° |
β | 91.646 ± 0.003° |
γ | 90° |
Cell volume | 1208.25 ± 0.14 Å3 |
Cell temperature | 200 ± 2 K |
Ambient diffraction temperature | 200 ± 2 K |
Number of distinct elements | 5 |
Space group number | 14 |
Hermann-Mauguin space group symbol | P 1 21/c 1 |
Hall space group symbol | -P 2ybc |
Residual factor for all reflections | 0.0385 |
Residual factor for significantly intense reflections | 0.0274 |
Weighted residual factors for significantly intense reflections | 0.0853 |
Weighted residual factors for all reflections included in the refinement | 0.1324 |
Goodness-of-fit parameter for all reflections included in the refinement | 1.187 |
Diffraction radiation wavelength | 0.71073 Å |
Diffraction radiation type | MoKα |