Information card for entry 7226157
Formula | C13 H9 O5 P Zn |
Calculated formula | C13 H9 O5 P Zn |
Title of publication | Syntheses, structures and properties of group 12 element (Zn, Cd, Hg) coordination polymers with a mixed-functional phosphonate-biphenyl-carboxylate linker |
Authors of publication | Heering, Christian; Francis, Biju; Nateghi, Bahareh; Makhloufi, Gamall; Lüdeke, Steffen; Janiak, Christoph |
Journal of publication | CrystEngComm |
Year of publication | 2016 |
Journal volume | 18 |
Journal issue | 27 |
Pages of publication | 5209 |
a | 5.2848 ± 0.0012 Å |
b | 8.1031 ± 0.0018 Å |
c | 27.371 ± 0.006 Å |
α | 90° |
β | 91.766 ± 0.012° |
γ | 90° |
Cell volume | 1171.6 ± 0.5 Å3 |
Cell temperature | 173 ± 2 K |
Ambient diffraction temperature | 173 ± 2 K |
Number of distinct elements | 5 |
Space group number | 12 |
Hermann-Mauguin space group symbol | C 1 2/m 1 |
Hall space group symbol | -C 2y |
Residual factor for all reflections | 0.083 |
Residual factor for significantly intense reflections | 0.0681 |
Weighted residual factors for significantly intense reflections | 0.152 |
Weighted residual factors for all reflections included in the refinement | 0.163 |
Goodness-of-fit parameter for all reflections included in the refinement | 1.053 |
Diffraction radiation wavelength | 0.71073 Å |
Diffraction radiation type | MoKα |