Information card for entry 7226159
Formula | C26 H20 O14 P2 Zn5 |
Calculated formula | C26 H20 O14 P2 Zn5 |
Title of publication | Syntheses, structures and properties of group 12 element (Zn, Cd, Hg) coordination polymers with a mixed-functional phosphonate-biphenyl-carboxylate linker |
Authors of publication | Heering, Christian; Francis, Biju; Nateghi, Bahareh; Makhloufi, Gamall; Lüdeke, Steffen; Janiak, Christoph |
Journal of publication | CrystEngComm |
Year of publication | 2016 |
Journal volume | 18 |
Journal issue | 27 |
Pages of publication | 5209 |
a | 32.838 ± 0.012 Å |
b | 5.3763 ± 0.0019 Å |
c | 7.913 ± 0.003 Å |
α | 90° |
β | 103.531 ± 0.011° |
γ | 90° |
Cell volume | 1358.2 ± 0.9 Å3 |
Cell temperature | 173 ± 2 K |
Ambient diffraction temperature | 173 ± 2 K |
Number of distinct elements | 5 |
Space group number | 5 |
Hermann-Mauguin space group symbol | C 1 2 1 |
Hall space group symbol | C 2y |
Residual factor for all reflections | 0.051 |
Residual factor for significantly intense reflections | 0.0412 |
Weighted residual factors for significantly intense reflections | 0.0819 |
Weighted residual factors for all reflections included in the refinement | 0.0851 |
Goodness-of-fit parameter for all reflections included in the refinement | 1.011 |
Diffraction radiation wavelength | 0.71073 Å |
Diffraction radiation type | MoKα |