Information card for entry 7226163
Chemical name | Complex 2 |
Formula | C10 H12 K O16 Tb |
Calculated formula | C10 H12 K O16 Tb |
Title of publication | Construction of multifunctional materials based on Tb3+and croconic acid, directed by K+cations: synthesis, structures, fluorescence, magnetic and ferroelectric behaviors |
Authors of publication | Jia, Yu-Qi; Feng, Si-Si; Shen, Mei-Lin; Lu, Li-Ping |
Journal of publication | CrystEngComm |
Year of publication | 2016 |
Journal volume | 18 |
Journal issue | 28 |
Pages of publication | 5344 |
a | 20.232 ± 0.004 Å |
b | 9.072 ± 0.0018 Å |
c | 16.015 ± 0.003 Å |
α | 90° |
β | 116.84 ± 0.03° |
γ | 90° |
Cell volume | 2622.8 ± 1.1 Å3 |
Cell temperature | 100 ± 2 K |
Ambient diffraction temperature | 100 ± 2 K |
Number of distinct elements | 5 |
Space group number | 15 |
Hermann-Mauguin space group symbol | C 1 2/c 1 |
Hall space group symbol | -C 2yc |
Residual factor for all reflections | 0.0495 |
Residual factor for significantly intense reflections | 0.0481 |
Weighted residual factors for significantly intense reflections | 0.1724 |
Weighted residual factors for all reflections included in the refinement | 0.1771 |
Goodness-of-fit parameter for all reflections included in the refinement | 1.014 |
Diffraction radiation wavelength | 0.72 Å |
Diffraction radiation type | synchrotron |