Information card for entry 7226171
Formula | C13 H12 Cl2 N4 O Pb |
Calculated formula | C13 H12 Cl2 N4 O Pb |
Title of publication | Metal‒organic and supramolecular lead(ii) networks assembled from isomeric nicotinoylhydrazone blocks: the effects of ligand geometry and counter-ion on topology and supramolecular assembly |
Authors of publication | Mahmoudi, Ghodrat; Bauzá, Antonio; Frontera, Antonio; Garczarek, Piotr; Stilinović, Vladimir; Kirillov, Alexander M.; Kennedy, Alan; Ruiz-Pérez, Catalina |
Journal of publication | CrystEngComm |
Year of publication | 2016 |
Journal volume | 18 |
Journal issue | 28 |
Pages of publication | 5375 |
a | 7.8658 ± 0.0007 Å |
b | 8.6864 ± 0.0007 Å |
c | 11.002 ± 0.0009 Å |
α | 100.321 ± 0.004° |
β | 92.891 ± 0.005° |
γ | 95.189 ± 0.004° |
Cell volume | 734.82 ± 0.11 Å3 |
Cell temperature | 150 ± 2 K |
Ambient diffraction temperature | 150 ± 2 K |
Number of distinct elements | 6 |
Space group number | 2 |
Hermann-Mauguin space group symbol | P -1 |
Hall space group symbol | -P 1 |
Residual factor for all reflections | 0.0182 |
Residual factor for significantly intense reflections | 0.0172 |
Weighted residual factors for significantly intense reflections | 0.0434 |
Weighted residual factors for all reflections included in the refinement | 0.0439 |
Goodness-of-fit parameter for all reflections included in the refinement | 1.034 |
Diffraction radiation wavelength | 0.71073 Å |
Diffraction radiation type | MoKα |