Information card for entry 7226188
Formula | C21 H14 N6 O5 Pb |
Calculated formula | C21 H14 N6 O5 Pb |
Title of publication | Layer-structured coordination polymers based on 5-(1H-tetrazol-5-yl)isophthalic acid: structure, sensitization of lanthanide(iii) cations and small-molecule sensing |
Authors of publication | Jia, Jia; Xu, Jianing; Wang, Shengyan; Wang, Pengcheng; Gao, Lijuan; Chai, Juan; Shen, Lanlan; Chen, Xiaobo; Fan, Yong; Wang, Li |
Journal of publication | CrystEngComm |
Year of publication | 2016 |
Journal volume | 18 |
Journal issue | 37 |
Pages of publication | 7126 |
a | 11.2006 ± 0.0016 Å |
b | 11.1967 ± 0.0016 Å |
c | 18.5221 ± 0.0018 Å |
α | 90° |
β | 121.7 ± 0.006° |
γ | 90° |
Cell volume | 1976.3 ± 0.5 Å3 |
Cell temperature | 296 ± 2 K |
Ambient diffraction temperature | 296 ± 2 K |
Number of distinct elements | 5 |
Space group number | 14 |
Hermann-Mauguin space group symbol | P 1 21/c 1 |
Hall space group symbol | -P 2ybc |
Residual factor for all reflections | 0.0241 |
Residual factor for significantly intense reflections | 0.0208 |
Weighted residual factors for significantly intense reflections | 0.0513 |
Weighted residual factors for all reflections included in the refinement | 0.0525 |
Goodness-of-fit parameter for all reflections included in the refinement | 1.063 |
Diffraction radiation wavelength | 0.71073 Å |
Diffraction radiation type | MoKα |