Information card for entry 7226220
Formula |
C19 H19 B F2 N2 |
Calculated formula |
C19 H19 B F2 N2 |
SMILES |
c1ccc2C(=c3ccc[n]3[B](n12)(F)F)c1ccc(cc1)C(C)(C)C |
Title of publication |
Synthesis, structure, photophysical, electrochemical properties and antibacterial activity of brominated BODIPYs |
Authors of publication |
Prasannan, Dijo; Raghav, Darpan; Subramaniam, Sujatha; Hareendrakrishna kumar, Haritha; K, Rathinasamy; Arunkumar, Chellaiah |
Journal of publication |
RSC Adv. |
Year of publication |
2016 |
a |
9.1279 ± 0.0006 Å |
b |
11.6936 ± 0.0009 Å |
c |
15.8335 ± 0.0012 Å |
α |
90° |
β |
90° |
γ |
90° |
Cell volume |
1690 ± 0.2 Å3 |
Cell temperature |
296 ± 2 K |
Ambient diffraction temperature |
296 ± 2 K |
Number of distinct elements |
5 |
Space group number |
19 |
Hermann-Mauguin space group symbol |
P 21 21 21 |
Hall space group symbol |
P 2ac 2ab |
Residual factor for all reflections |
0.0797 |
Residual factor for significantly intense reflections |
0.048 |
Weighted residual factors for significantly intense reflections |
0.1172 |
Weighted residual factors for all reflections included in the refinement |
0.1413 |
Goodness-of-fit parameter for all reflections included in the refinement |
1.051 |
Diffraction radiation wavelength |
0.71073 Å |
Diffraction radiation type |
MoKα |
Yes |
No |
No |