Information card for entry 7226265
Formula | C34 H42 Au2 Cl2 N4 O2 P2 |
Calculated formula | C34 H42 Au2 Cl2 N4 O2 P2 |
Title of publication | A stimuli-responsive Au(i) complex based on an aminomethylphosphine template: synthesis, crystalline phases and luminescence properties |
Authors of publication | Strelnik, Igor D.; Gurzhiy, Vladislav V.; Sizov, Vladimir V.; Musina, Elvira I.; Karasik, Andrey A.; Tunik, Sergey P.; Grachova, Elena V. |
Journal of publication | CrystEngComm |
Year of publication | 2016 |
Journal volume | 18 |
Journal issue | 39 |
Pages of publication | 7629 |
a | 24.029 ± 0.004 Å |
b | 16.9105 ± 0.0016 Å |
c | 12.0433 ± 0.0018 Å |
α | 90° |
β | 124.55 ± 0.02° |
γ | 90° |
Cell volume | 4030.6 ± 1.4 Å3 |
Cell temperature | 100 ± 2 K |
Ambient diffraction temperature | 100 ± 2 K |
Number of distinct elements | 7 |
Space group number | 12 |
Hermann-Mauguin space group symbol | C 1 2/m 1 |
Hall space group symbol | -C 2y |
Residual factor for all reflections | 0.049 |
Residual factor for significantly intense reflections | 0.0352 |
Weighted residual factors for significantly intense reflections | 0.082 |
Weighted residual factors for all reflections included in the refinement | 0.0879 |
Goodness-of-fit parameter for all reflections included in the refinement | 1.057 |
Diffraction radiation wavelength | 0.71073 Å |
Diffraction radiation type | MoKα |