Information card for entry 7226269
Formula | C16 H36 Cr N10 Ni O6 |
Calculated formula | C16 H36 Cr N10 Ni O6 |
Title of publication | Exploration of a new building block for the construction of cyano-bridged solvatomagnetic assemblies: [Ni(cyclam)]3+ |
Authors of publication | Nowicka, Beata; Heczko, Michał; Reczyński, Mateusz; Rams, Michał; Gaweł, Bartłomiej; Nitek, Wojciech; Sieklucka, Barbara |
Journal of publication | CrystEngComm |
Year of publication | 2016 |
Journal volume | 18 |
Journal issue | 37 |
Pages of publication | 7011 |
a | 10.5579 ± 0.0005 Å |
b | 16.3314 ± 0.0006 Å |
c | 8.8748 ± 0.0004 Å |
α | 90° |
β | 112.254 ± 0.003° |
γ | 90° |
Cell volume | 1416.26 ± 0.11 Å3 |
Cell temperature | 120 ± 2 K |
Ambient diffraction temperature | 120 ± 2 K |
Number of distinct elements | 6 |
Space group number | 12 |
Hermann-Mauguin space group symbol | C 1 2/m 1 |
Hall space group symbol | -C 2y |
Residual factor for all reflections | 0.0585 |
Residual factor for significantly intense reflections | 0.0367 |
Weighted residual factors for significantly intense reflections | 0.0618 |
Weighted residual factors for all reflections included in the refinement | 0.0679 |
Goodness-of-fit parameter for all reflections included in the refinement | 1.044 |
Diffraction radiation wavelength | 0.71073 Å |
Diffraction radiation type | MoKα |