Information card for entry 7226298
Formula | C14 H20 Hg I2 N2 Si2 |
Calculated formula | C14 H20 Hg I2 N2 Si2 |
Title of publication | In situ crystalline transformation of bis(halo)mercury(ii) coordination polymers to ionic chloro-bridged-bis(halo)mercury(ii) species via UV irradiation in chloroform media |
Authors of publication | Choi, Eunkyung; Lee, Haeri; Noh, Tae Hwan; Jung, Ok-Sang |
Journal of publication | CrystEngComm |
Year of publication | 2016 |
Journal volume | 18 |
Journal issue | 37 |
Pages of publication | 6997 |
a | 9.5172 ± 0.0004 Å |
b | 13.6206 ± 0.0004 Å |
c | 16.3559 ± 0.0005 Å |
α | 90° |
β | 98.7 ± 0.002° |
γ | 90° |
Cell volume | 2095.82 ± 0.13 Å3 |
Cell temperature | 173 ± 2 K |
Ambient diffraction temperature | 173 ± 2 K |
Number of distinct elements | 6 |
Space group number | 15 |
Hermann-Mauguin space group symbol | C 1 2/c 1 |
Hall space group symbol | -C 2yc |
Residual factor for all reflections | 0.0431 |
Residual factor for significantly intense reflections | 0.0423 |
Weighted residual factors for significantly intense reflections | 0.1131 |
Weighted residual factors for all reflections included in the refinement | 0.1141 |
Goodness-of-fit parameter for all reflections included in the refinement | 1.046 |
Diffraction radiation wavelength | 0.71073 Å |
Diffraction radiation type | MoKα |