Information card for entry 7226320
Chemical name | (+)-erythro-N-(N-allylthiocarbamoyl) mefloquine, (11R,12S) |
Formula | C23 H24 F6 N4 O S |
Calculated formula | C23 H24 F6 N4 O S |
SMILES | S=C(N1[C@H]([C@H](O)c2cc(nc3c2cccc3C(F)(F)F)C(F)(F)F)CCCC1)NCC=C.N#CC |
Title of publication | Absolute configuration of the antimalarial erythro-mefloquine ‒ Vibrational Circular Dichroism and X-ray diffraction studies of mefloquine and its thiourea derivative |
Authors of publication | Kohout, Michal; Vandenbussche, Jelle; Roller, Alexander; Tůma, Jiří; Bogaerts, Jonathan; Bultinck, Patrick; Herrebout, Wouter; Lindner, Wolfgang |
Journal of publication | RSC Adv. |
Year of publication | 2016 |
a | 5.7556 ± 0.0001 Å |
b | 15.8271 ± 0.0004 Å |
c | 26.2952 ± 0.0006 Å |
α | 90° |
β | 90° |
γ | 90° |
Cell volume | 2395.35 ± 0.09 Å3 |
Cell temperature | 100 ± 2 K |
Ambient diffraction temperature | 100 K |
Number of distinct elements | 6 |
Space group number | 19 |
Hermann-Mauguin space group symbol | P 21 21 21 |
Hall space group symbol | P 2ac 2ab |
Residual factor for all reflections | 0.0273 |
Residual factor for significantly intense reflections | 0.0265 |
Weighted residual factors for significantly intense reflections | 0.0695 |
Weighted residual factors for all reflections included in the refinement | 0.0699 |
Goodness-of-fit parameter for all reflections included in the refinement | 1.064 |
Diffraction radiation wavelength | 1.54178 Å |
Diffraction radiation type | CuKα |