Information card for entry 7226350
Common name | lithium cobalt phosphate |
Chemical name | lithium cobalt phosphate |
Formula | Co Li O4 P |
Calculated formula | Co Li O4 P |
Title of publication | Facile, ethylene glycol-promoted microwave-assisted solvothermal synthesis of high-performance LiCoPO4as a high-voltage cathode material for lithium-ion batteries |
Authors of publication | Ludwig, Jennifer; Marino, Cyril; Haering, Dominik; Stinner, Christoph; Nordlund, Dennis; Doeff, Marca; Gasteiger, Hubert A.; Nilges, Tom |
Journal of publication | RSC Adv. |
Year of publication | 2016 |
a | 10.193 ± 0.0007 Å |
b | 5.9188 ± 0.0004 Å |
c | 4.6959 ± 0.0003 Å |
α | 90° |
β | 90° |
γ | 90° |
Cell volume | 283.31 ± 0.03 Å3 |
Cell temperature | 298 K |
Ambient diffraction temperature | 298 K |
Number of distinct elements | 4 |
Space group number | 62 |
Hermann-Mauguin space group symbol | P n m a |
Hall space group symbol | -P 2ac 2n |
Residual factor for all reflections | 0.0412 |
Residual factor for significantly intense reflections | 0.0409 |
Weighted residual factors for all reflections | 0.038 |
Weighted residual factors for significantly intense reflections | 0.038 |
Goodness-of-fit parameter for all reflections | 1.35 |
Method of determination | powder diffraction |
Diffraction radiation probe | x-ray |
Diffraction radiation wavelength | 0.7093 Å |
Diffraction radiation type | MoKα1 |