Information card for entry 7226374
Formula | C20 H20 Dy2 N10 O18 |
Calculated formula | C20 H20 Dy2 N10 O18 |
SMILES | c12[n](cccc2)[Dy]23456(ON(=[O]2)=O)([n]2c1cccc2)ON(=O)=[O][Dy]127([n]8c(c9cccc[n]19)cccc8)(ON(=[O])=[O]3)(ON(=[O]2)=O)([O]4N(=[O]6)=[O])[O]5N(=[O]7)=[O] |
Title of publication | Lanthanide MOFs Constructed Based on a Difunctional Ligand with Bimodal Emission and Eu3+ doped Dy3+ Materials: White Emission and Color Tuning. |
Authors of publication | Xiao, Peng; Wang, Ping; Fan, Ruiqing; Du, Xi; Chen, Wei; Zhang, Huijie; Song, Yang; Yang, Yulin |
Journal of publication | RSC Adv. |
Year of publication | 2016 |
a | 8.41 ± 0.0017 Å |
b | 8.861 ± 0.0018 Å |
c | 12.488 ± 0.003 Å |
α | 105.92 ± 0.03° |
β | 108.02 ± 0.03° |
γ | 99.01 ± 0.03° |
Cell volume | 820.8 ± 0.4 Å3 |
Cell temperature | 293 ± 2 K |
Ambient diffraction temperature | 293 ± 2 K |
Number of distinct elements | 5 |
Space group number | 2 |
Hermann-Mauguin space group symbol | P -1 |
Hall space group symbol | -P 1 |
Residual factor for all reflections | 0.0312 |
Residual factor for significantly intense reflections | 0.0294 |
Weighted residual factors for significantly intense reflections | 0.0786 |
Weighted residual factors for all reflections included in the refinement | 0.0816 |
Goodness-of-fit parameter for all reflections included in the refinement | 1.074 |
Diffraction radiation wavelength | 0.71073 Å |
Diffraction radiation type | MoKα |