Information card for entry 7226381
Formula | C35 H41 Fe N3 O2 S |
Calculated formula | C35 H41 Fe N3 O2 S |
SMILES | [Fe]1(Sc2ccccc2N1)(C#[O])(C#[O])=C1N(c2c(C(C)C)cccc2C(C)C)C=CN1c1c(cccc1C(C)C)C(C)C |
Title of publication | Synthesis, Structural Characterization, and Chemical Properties of Pentacoordinate Model Complexes for the Active Site of [Fe]-Hydrogenase |
Authors of publication | Jiang, Shuang; Zhang, Tianyong; Zhang, Xia; Zhang, Guanghui; Hai, Li; Li, Bin |
Journal of publication | RSC Adv. |
Year of publication | 2016 |
a | 11.478 ± 0.002 Å |
b | 14.306 ± 0.003 Å |
c | 20.809 ± 0.004 Å |
α | 82.76 ± 0.03° |
β | 80.15 ± 0.03° |
γ | 76.45 ± 0.03° |
Cell volume | 3259.7 ± 1.2 Å3 |
Cell temperature | 113 ± 2 K |
Ambient diffraction temperature | 113 ± 2 K |
Number of distinct elements | 6 |
Space group number | 2 |
Hermann-Mauguin space group symbol | P -1 |
Hall space group symbol | -P 1 |
Residual factor for all reflections | 0.1225 |
Residual factor for significantly intense reflections | 0.0935 |
Weighted residual factors for significantly intense reflections | 0.243 |
Weighted residual factors for all reflections included in the refinement | 0.2592 |
Goodness-of-fit parameter for all reflections included in the refinement | 1.033 |
Diffraction radiation wavelength | 0.71073 Å |
Diffraction radiation type | MoKα |