Information card for entry 7226394
Formula | C9 H22 Ce2 O20 |
Calculated formula | C9 H6 Ce2 O20 |
Title of publication | Crystal growth and structural remarks on malonate-based lanthanide coordination polymers |
Authors of publication | Delgado, Fernando S.; Lorenzo-Luís, Pablo; Pasán, Jorge; Cañadillas-Delgado, Laura; Fabelo, Oscar; Hernández-Molina, María; Lozano-Gorrín, Antonio D.; Lloret, Francesc; Julve, Miguel; Ruiz-Pérez, Catalina |
Journal of publication | CrystEngComm |
Year of publication | 2016 |
Journal volume | 18 |
Journal issue | 40 |
Pages of publication | 7831 |
a | 11.3106 ± 0.0007 Å |
b | 12.6698 ± 0.0012 Å |
c | 14.7397 ± 0.0015 Å |
α | 90° |
β | 90° |
γ | 90° |
Cell volume | 2112.2 ± 0.3 Å3 |
Cell temperature | 293 ± 2 K |
Ambient diffraction temperature | 293 ± 2 K |
Number of distinct elements | 4 |
Space group number | 60 |
Hermann-Mauguin space group symbol | P b c n |
Hall space group symbol | -P 2n 2ab |
Residual factor for all reflections | 0.0624 |
Residual factor for significantly intense reflections | 0.0415 |
Weighted residual factors for significantly intense reflections | 0.0926 |
Weighted residual factors for all reflections included in the refinement | 0.1024 |
Goodness-of-fit parameter for all reflections included in the refinement | 1.109 |
Diffraction radiation probe | x-ray |
Diffraction radiation wavelength | 0.71073 Å |
Diffraction radiation type | Mokα |