Information card for entry 7226466
Formula | C16 H14 Ag2 N4 O4 S |
Calculated formula | C16 H14 Ag2 N4 O4 S |
Title of publication | Diverse structural assemblies of silver‒thiophene-2,5-dicarboxylate coordination complexes contribute to different proton-conducting performances |
Authors of publication | Zheng, Xiao-Feng; Li, Wen-Qiang; Du, Jun; Luo, Xian-Zhu; Liu, Miao-Miao; Yu, Yang; Tian, Lai-Jin |
Journal of publication | CrystEngComm |
Year of publication | 2016 |
Journal volume | 18 |
Journal issue | 40 |
Pages of publication | 7814 |
a | 10.372 ± 0.0012 Å |
b | 5.6131 ± 0.0006 Å |
c | 30.25 ± 0.003 Å |
α | 90° |
β | 97.097 ± 0.001° |
γ | 90° |
Cell volume | 1747.6 ± 0.3 Å3 |
Cell temperature | 295 ± 2 K |
Ambient diffraction temperature | 295 ± 2 K |
Number of distinct elements | 6 |
Space group number | 14 |
Hermann-Mauguin space group symbol | P 1 21/c 1 |
Hall space group symbol | -P 2ybc |
Residual factor for all reflections | 0.0443 |
Residual factor for significantly intense reflections | 0.0403 |
Weighted residual factors for significantly intense reflections | 0.0859 |
Weighted residual factors for all reflections included in the refinement | 0.088 |
Goodness-of-fit parameter for all reflections included in the refinement | 1.028 |
Diffraction radiation wavelength | 0.71073 Å |
Diffraction radiation type | MoKα |