Information card for entry 7226480
Formula |
C80 H72 Mn2 N6 O12 |
Calculated formula |
C80 H72 Mn2 N6 O12 |
Title of publication |
A new chiral dimanganese(III) complex: synthesis, crystal structure, spectroscopic, magnetic, and catalytic properties |
Authors of publication |
Andruh, Marius; Dinca, Alina Simona; Candu, Natalia; Julve, Miguel; Lloret, Francesc; Sova, Sergiu; Parvulescu, Vasile i |
Journal of publication |
RSC Adv. |
Year of publication |
2016 |
a |
11.5575 ± 0.0003 Å |
b |
24.1622 ± 0.0006 Å |
c |
24.5872 ± 0.0007 Å |
α |
90° |
β |
90° |
γ |
90° |
Cell volume |
6866.1 ± 0.3 Å3 |
Cell temperature |
200 ± 0.1 K |
Ambient diffraction temperature |
200 ± 0.1 K |
Number of distinct elements |
5 |
Space group number |
19 |
Hermann-Mauguin space group symbol |
P 21 21 21 |
Hall space group symbol |
P 2ac 2ab |
Residual factor for all reflections |
0.092 |
Residual factor for significantly intense reflections |
0.0658 |
Weighted residual factors for significantly intense reflections |
0.1335 |
Weighted residual factors for all reflections included in the refinement |
0.1517 |
Goodness-of-fit parameter for all reflections included in the refinement |
1.026 |
Diffraction radiation wavelength |
0.71073 Å |
Diffraction radiation type |
MoKα |
Yes |
Yes |
No |