Information card for entry 7226563
Common name | bzo-terpyridine |
Chemical name | bzotpy |
Formula | C22 H17 N3 O |
Calculated formula | C22 H17 N3 O |
SMILES | n1ccccc1c1nc(cc(OCc2ccccc2)c1)c1ncccc1 |
Title of publication | Lattice interactions of terpyridines and their derivatives ‒ free terpyridines and their protonated forms |
Authors of publication | Lee, Young Hoon; Kim, Jee Young; Kim, Yang; Hayami, Shinya; Shin, Jong Won; Harrowfield, Jack; Stefankiewicz, Artur R. |
Journal of publication | CrystEngComm |
Year of publication | 2016 |
Journal volume | 18 |
Journal issue | 41 |
Pages of publication | 8059 |
a | 5.714 ± 0.0011 Å |
b | 16.831 ± 0.003 Å |
c | 17.555 ± 0.004 Å |
α | 90° |
β | 92.54 ± 0.03° |
γ | 90° |
Cell volume | 1686.6 ± 0.6 Å3 |
Cell temperature | 100 ± 2 K |
Ambient diffraction temperature | 100 ± 2 K |
Number of distinct elements | 4 |
Space group number | 14 |
Hermann-Mauguin space group symbol | P 1 21/n 1 |
Hall space group symbol | -P 2yn |
Residual factor for all reflections | 0.0514 |
Residual factor for significantly intense reflections | 0.0443 |
Weighted residual factors for significantly intense reflections | 0.1262 |
Weighted residual factors for all reflections included in the refinement | 0.1307 |
Goodness-of-fit parameter for all reflections included in the refinement | 1.077 |
Diffraction radiation wavelength | 0.7 Å |
Diffraction radiation type | Synchrotron |