Information card for entry 7226639
Formula | C74 H84 Co2 Dy4 N10 O34 |
Calculated formula | C74 H84 Co2 Dy4 N10 O34 |
SMILES | c12ccccc1[O]1[Co]3456[N](=C2)c2c(cccc2)C[O]24[Dy]4789%10([O]%11[Dy]%12%13%14%15(ON(=[O]%12)=O)([O]=C(O8)C)([O]9C(C)=[O]%10)[O]8[Dy]9%10%12%16([O]%17%14Cc%14c([N]%18=Cc%19ccccc%19[O]%13[Co]%13%19%17%18[N](=Cc%17c([O]9%13)cccc%17)c9c(cccc9)C[O]%15%10%19)cccc%14)([O]=C(C)O[Dy]912%118([O]67Cc1c([N]3=Cc2c([O]54)cccc2)cccc1)(ON(=[O]9)=O)[O]%12C(C)=[O]%16)(ON(=O)=O)[O]=CN(C)C)(ON(=O)=O)[O]=CN(C)C.OCC.C(C)O |
Title of publication | Chair-like [LnIII4CoIII2] (Ln = Dy, Eu, Gd, Tb) clusters including a [DyIII4CoIII2] single molecule magnet |
Authors of publication | Zhang, Haifeng; Liu, Rui; Zhang, Jin; Li, Yahong; Liu, Wei |
Journal of publication | CrystEngComm |
Year of publication | 2016 |
Journal volume | 18 |
Journal issue | 42 |
Pages of publication | 8246 |
a | 12.403 ± 0.004 Å |
b | 19.548 ± 0.007 Å |
c | 18.963 ± 0.007 Å |
α | 90° |
β | 103.787 ± 0.006° |
γ | 90° |
Cell volume | 4465 ± 3 Å3 |
Cell temperature | 296 ± 2 K |
Ambient diffraction temperature | 296 ± 2 K |
Number of distinct elements | 6 |
Space group number | 14 |
Hermann-Mauguin space group symbol | P 1 21/c 1 |
Hall space group symbol | -P 2ybc |
Residual factor for all reflections | 0.0562 |
Residual factor for significantly intense reflections | 0.0324 |
Weighted residual factors for significantly intense reflections | 0.0763 |
Weighted residual factors for all reflections included in the refinement | 0.085 |
Goodness-of-fit parameter for all reflections included in the refinement | 1.018 |
Diffraction radiation wavelength | 0.71073 Å |
Diffraction radiation type | MoKα |