Information card for entry 7226655
Common name | second crystal ic18028 |
Chemical name | 3i |
Formula | C22 H20 N4 O10 |
Calculated formula | C22 H20 N4 O10 |
SMILES | O=C1CC[C@]2(O)[C@]1([C@H]([C@@H](N(=O)=O)[C@@H]([C@H]2N(=O)=O)c1c(N(=O)=O)cccc1)c1c(N(=O)=O)cccc1)C |
Title of publication | Constructing Densely Functionalized Hajos‒Parrish-type Ketones with Six Contiguous Stereogenic Centers and Two Quaternary Carbons in a Formal [2 + 2 + 2] Cycloaddition Cascade |
Authors of publication | Peng, Chieh-Hung; Hong, Bor-Cherng; Raja, Arun; Chang, Chun-Wei; Lee, Gene-Hsiang |
Journal of publication | RSC Adv. |
Year of publication | 2016 |
a | 9.3839 ± 0.0002 Å |
b | 11.609 ± 0.0002 Å |
c | 19.7514 ± 0.0004 Å |
α | 90° |
β | 90° |
γ | 90° |
Cell volume | 2151.67 ± 0.07 Å3 |
Cell temperature | 200 ± 2 K |
Ambient diffraction temperature | 200 ± 2 K |
Number of distinct elements | 4 |
Space group number | 19 |
Hermann-Mauguin space group symbol | P 21 21 21 |
Hall space group symbol | P 2ac 2ab |
Residual factor for all reflections | 0.0245 |
Residual factor for significantly intense reflections | 0.024 |
Weighted residual factors for significantly intense reflections | 0.0617 |
Weighted residual factors for all reflections included in the refinement | 0.0621 |
Goodness-of-fit parameter for all reflections included in the refinement | 1.051 |
Diffraction radiation wavelength | 1.54178 Å |
Diffraction radiation type | CuKα |