Information card for entry 7226657
Common name | ic18058-1 |
Chemical name | 5a |
Formula | C22 H22 N2 O6 |
Calculated formula | C22 H22 N2 O6 |
SMILES | O=C1CC[C@@]2(O)[C@@]1([C@H]([C@@H](N(=O)=O)[C@H]([C@@H]2N(=O)=O)c1ccccc1)c1ccccc1)C |
Title of publication | Constructing Densely Functionalized Hajos‒Parrish-type Ketones with Six Contiguous Stereogenic Centers and Two Quaternary Carbons in a Formal [2 + 2 + 2] Cycloaddition Cascade |
Authors of publication | Peng, Chieh-Hung; Hong, Bor-Cherng; Raja, Arun; Chang, Chun-Wei; Lee, Gene-Hsiang |
Journal of publication | RSC Adv. |
Year of publication | 2016 |
a | 6.6053 ± 0.0001 Å |
b | 16.3208 ± 0.0003 Å |
c | 18.4301 ± 0.0003 Å |
α | 90° |
β | 90° |
γ | 90° |
Cell volume | 1986.83 ± 0.06 Å3 |
Cell temperature | 200 ± 2 K |
Ambient diffraction temperature | 200 ± 2 K |
Number of distinct elements | 4 |
Space group number | 19 |
Hermann-Mauguin space group symbol | P 21 21 21 |
Hall space group symbol | P 2ac 2ab |
Residual factor for all reflections | 0.0326 |
Residual factor for significantly intense reflections | 0.0318 |
Weighted residual factors for significantly intense reflections | 0.0793 |
Weighted residual factors for all reflections included in the refinement | 0.08 |
Goodness-of-fit parameter for all reflections included in the refinement | 1.065 |
Diffraction radiation wavelength | 1.54178 Å |
Diffraction radiation type | CuKα |