Information card for entry 7226707
Formula | C19 H16 Fe O2 |
Calculated formula | C19 H16 Fe O2 |
SMILES | [Fe]12345678([cH]9[cH]4[cH]3[cH]2[cH]19)[cH]1[cH]5[cH]6[cH]7[c]81/C=C/C(=O)c1cccc(O)c1 |
Title of publication | Ferrocenyl Chalcones with Phenolic and Pyridyl Anchors as Potential Sensitizers in Dye-Sensitized Solar Cells |
Authors of publication | Kumar, Abhinav; Chauhan, Ratna; Yadav, Reena; Singh, Ashish Kumar; Trivedi, Manoj; Kociok-Kohn, Gabriele; Rane, Sunit; Gosavi, Suresh |
Journal of publication | RSC Adv. |
Year of publication | 2016 |
a | 11.7994 ± 0.0004 Å |
b | 10.9413 ± 0.0003 Å |
c | 11.2628 ± 0.0003 Å |
α | 90° |
β | 100.824 ± 0.003° |
γ | 90° |
Cell volume | 1428.17 ± 0.07 Å3 |
Cell temperature | 150 ± 2 K |
Ambient diffraction temperature | 150 ± 2 K |
Number of distinct elements | 4 |
Space group number | 14 |
Hermann-Mauguin space group symbol | P 1 21/c 1 |
Hall space group symbol | -P 2ybc |
Residual factor for all reflections | 0.0388 |
Residual factor for significantly intense reflections | 0.0309 |
Weighted residual factors for significantly intense reflections | 0.0698 |
Weighted residual factors for all reflections included in the refinement | 0.073 |
Goodness-of-fit parameter for all reflections included in the refinement | 1.062 |
Diffraction radiation wavelength | 0.71073 Å |
Diffraction radiation type | MoKα |