Information card for entry 7226728
Formula | C60 H84 N4 O12 S8 |
Calculated formula | C60 H80 N4 O12 S8 |
Title of publication | Molecular tectonics: tetracarboxythiacalix[4]arene derivatives as tectons for the formation of hydrogen-bonded networks |
Authors of publication | Ovsyannikov, A. S.; Lang, M. N.; Ferlay, S.; Solovieva, S. E.; Antipin, I. S.; Konovalov, A. I.; Kyritsakas, N.; Hosseini, M. W. |
Journal of publication | CrystEngComm |
Year of publication | 2016 |
Journal volume | 18 |
Journal issue | 44 |
Pages of publication | 8622 |
a | 16.6796 ± 0.0002 Å |
b | 16.6796 ± 0.0002 Å |
c | 11.9659 ± 0.0002 Å |
α | 90° |
β | 90° |
γ | 90° |
Cell volume | 3329.02 ± 0.08 Å3 |
Cell temperature | 173 ± 2 K |
Ambient diffraction temperature | 173 ± 2 K |
Number of distinct elements | 5 |
Space group number | 86 |
Hermann-Mauguin space group symbol | P 42/n :2 |
Hall space group symbol | -P 4bc |
Residual factor for all reflections | 0.0743 |
Residual factor for significantly intense reflections | 0.0523 |
Weighted residual factors for significantly intense reflections | 0.1536 |
Weighted residual factors for all reflections included in the refinement | 0.1763 |
Goodness-of-fit parameter for all reflections included in the refinement | 1.052 |
Diffraction radiation wavelength | 0.71073 Å |
Diffraction radiation type | MoKα |