Information card for entry 7226731
Formula | C145 H150 Cl2 O18 S16 |
Calculated formula | C145 H144 Cl2 O18 S16 |
Title of publication | Molecular tectonics: tetracarboxythiacalix[4]arene derivatives as tectons for the formation of hydrogen-bonded networks |
Authors of publication | Ovsyannikov, A. S.; Lang, M. N.; Ferlay, S.; Solovieva, S. E.; Antipin, I. S.; Konovalov, A. I.; Kyritsakas, N.; Hosseini, M. W. |
Journal of publication | CrystEngComm |
Year of publication | 2016 |
Journal volume | 18 |
Journal issue | 44 |
Pages of publication | 8622 |
a | 12.2472 ± 0.0003 Å |
b | 15.6106 ± 0.0004 Å |
c | 20.633 ± 0.0006 Å |
α | 92.39 ± 0.002° |
β | 96.895 ± 0.001° |
γ | 96.801 ± 0.001° |
Cell volume | 3882.4 ± 0.18 Å3 |
Cell temperature | 173 ± 2 K |
Ambient diffraction temperature | 173 ± 2 K |
Number of distinct elements | 5 |
Space group number | 2 |
Hermann-Mauguin space group symbol | P -1 |
Hall space group symbol | -P 1 |
Residual factor for all reflections | 0.0854 |
Residual factor for significantly intense reflections | 0.0616 |
Weighted residual factors for significantly intense reflections | 0.1956 |
Weighted residual factors for all reflections included in the refinement | 0.2153 |
Goodness-of-fit parameter for all reflections included in the refinement | 1.105 |
Diffraction radiation wavelength | 0.71073 Å |
Diffraction radiation type | MoKα |