Information card for entry 7226734
Formula | C92 H112 N8 O10 S8 |
Calculated formula | C92 H104 N8 O10 S8 |
Title of publication | Molecular tectonics: tetracarboxythiacalix[4]arene derivatives as tectons for the formation of hydrogen-bonded networks |
Authors of publication | Ovsyannikov, A. S.; Lang, M. N.; Ferlay, S.; Solovieva, S. E.; Antipin, I. S.; Konovalov, A. I.; Kyritsakas, N.; Hosseini, M. W. |
Journal of publication | CrystEngComm |
Year of publication | 2016 |
Journal volume | 18 |
Journal issue | 44 |
Pages of publication | 8622 |
a | 11.0804 ± 0.0005 Å |
b | 22.8508 ± 0.001 Å |
c | 19.1244 ± 0.0006 Å |
α | 90° |
β | 105.727 ± 0.001° |
γ | 90° |
Cell volume | 4660.9 ± 0.3 Å3 |
Cell temperature | 173 ± 2 K |
Ambient diffraction temperature | 173 ± 2 K |
Number of distinct elements | 5 |
Space group number | 13 |
Hermann-Mauguin space group symbol | P 1 2/n 1 |
Hall space group symbol | -P 2yac |
Residual factor for all reflections | 0.2288 |
Residual factor for significantly intense reflections | 0.1264 |
Weighted residual factors for significantly intense reflections | 0.2812 |
Weighted residual factors for all reflections included in the refinement | 0.3383 |
Goodness-of-fit parameter for all reflections included in the refinement | 1.019 |
Diffraction radiation wavelength | 0.71073 Å |
Diffraction radiation type | MoKα |