Information card for entry 7226753
Formula |
C29 H22 N O4 |
Calculated formula |
C29 H22 N O4 |
Title of publication |
Highly Sensitive Ratiometric Fluorescence Probes for Nitric Oxide Based on Dihydropyridine and Potentially Useful in Bioimaging |
Authors of publication |
Mahapatra, Ajit Kumar; Ali, Syed Samim; Maiti, Kalipada; Mondal, Sanchita; Maji, Rajkishor; Manna, Srimanta; Manna, Saikat Kumar; Uddin, Md. Raihan; Mandal, Sukhendu |
Journal of publication |
RSC Adv. |
Year of publication |
2016 |
a |
8.69 ± 0.005 Å |
b |
9.93 ± 0.005 Å |
c |
13.591 ± 0.005 Å |
α |
90 ± 0.005° |
β |
90.853 ± 0.005° |
γ |
90 ± 0.005° |
Cell volume |
1172.7 ± 1 Å3 |
Cell temperature |
293 ± 2 K |
Ambient diffraction temperature |
293 ± 2 K |
Number of distinct elements |
4 |
Space group number |
4 |
Hermann-Mauguin space group symbol |
P 1 21 1 |
Hall space group symbol |
P 2yb |
Residual factor for all reflections |
0.1038 |
Residual factor for significantly intense reflections |
0.0867 |
Weighted residual factors for significantly intense reflections |
0.2181 |
Weighted residual factors for all reflections included in the refinement |
0.2417 |
Goodness-of-fit parameter for all reflections included in the refinement |
1.047 |
Diffraction radiation wavelength |
0.71073 Å |
Diffraction radiation type |
MoKα |
Yes |
No |
No |