Information card for entry 7226775
Chemical name | 2 |
Formula | C68 H66 Dy2 N4 O18 |
Calculated formula | C68 H66 Dy2 N4 O18 |
SMILES | c12c(cc(cc2/C=N/CCO)C)C=[N]2CC[OH][Dy]3452([OH]1)([O]=C(O3)c1ccccc1)([O]=C(O4)c1ccccc1)[O]=C(O[Dy]1234([N](=Cc6c(c(cc(c6)C)/C=N/CCO)[OH]1)CC[OH]2)([O]=C(O3)c1ccccc1)([O]=C(O4)c1ccccc1)[O]=C(O5)c1ccccc1)c1ccccc1 |
Title of publication | Syntheses, Structures and Magnetic Properties of Symmetrical Schiff-base Supported Dinuclear Ln(III) Compounds |
Authors of publication | Lin, Shuang-Yan; Wang, Chunlai; Xu, Zhikun |
Journal of publication | RSC Adv. |
Year of publication | 2016 |
a | 11.1487 ± 0.0007 Å |
b | 11.3872 ± 0.0007 Å |
c | 13.6878 ± 0.0008 Å |
α | 94.287 ± 0.001° |
β | 113.068 ± 0.001° |
γ | 97.695 ± 0.001° |
Cell volume | 1568.86 ± 0.17 Å3 |
Cell temperature | 185 ± 2 K |
Ambient diffraction temperature | 185 ± 2 K |
Number of distinct elements | 5 |
Space group number | 2 |
Hermann-Mauguin space group symbol | P -1 |
Hall space group symbol | -P 1 |
Residual factor for all reflections | 0.0272 |
Residual factor for significantly intense reflections | 0.0248 |
Weighted residual factors for significantly intense reflections | 0.0642 |
Weighted residual factors for all reflections included in the refinement | 0.0659 |
Goodness-of-fit parameter for all reflections included in the refinement | 1.045 |
Diffraction radiation wavelength | 0.71073 Å |
Diffraction radiation type | MoKα |