Information card for entry 7226825
Formula |
C18 H16 N14 O2 Zn |
Calculated formula |
C18 H16 N14 O2 Zn |
Title of publication |
Zn(II) and Cd(II) coordination networks based on N-donor ligand: synthesis, crystal structures, and sensing of nitroaromatic explosives |
Authors of publication |
Du, Jian-Long; Li, Chao-Ping; Gao, Ju-Ping; Zhang, Xiao-Ying; Jing, Xu; Mu, Yajuan; Li, Li-Jun |
Journal of publication |
RSC Adv. |
Year of publication |
2016 |
a |
7.4214 ± 0.0005 Å |
b |
7.6426 ± 0.0005 Å |
c |
9.4988 ± 0.001 Å |
α |
99.814 ± 0.002° |
β |
97.755 ± 0.002° |
γ |
110.091 ± 0.001° |
Cell volume |
487.55 ± 0.07 Å3 |
Cell temperature |
296 ± 2 K |
Ambient diffraction temperature |
296 ± 2 K |
Number of distinct elements |
5 |
Space group number |
2 |
Hermann-Mauguin space group symbol |
P -1 |
Hall space group symbol |
-P 1 |
Residual factor for all reflections |
0.0253 |
Residual factor for significantly intense reflections |
0.0236 |
Weighted residual factors for significantly intense reflections |
0.0586 |
Weighted residual factors for all reflections included in the refinement |
0.0596 |
Goodness-of-fit parameter for all reflections included in the refinement |
1.085 |
Diffraction radiation wavelength |
0.71073 Å |
Diffraction radiation type |
MoKα |
Yes |
No |
No |