Information card for entry 7226847
Formula | C9 H6 F2 O2 |
Calculated formula | C9.009 H6.006 F2.002 O2.002 |
Title of publication | Structural transformations in crystals induced by radiation and pressure. Part 5. The influence of pressure on the course of the photochemical reaction in crystals of 2,6-difluorocinnamic acid |
Authors of publication | Galica, T.; Bąkowicz, J.; Konieczny, K.; Turowska-Tyrk, I. |
Journal of publication | CrystEngComm |
Year of publication | 2016 |
Journal volume | 18 |
Journal issue | 46 |
Pages of publication | 8871 |
a | 3.639 ± 0.0007 Å |
b | 19.002 ± 0.004 Å |
c | 10.645 ± 0.005 Å |
α | 90° |
β | 91.14 ± 0.02° |
γ | 90° |
Cell volume | 735.9 ± 0.4 Å3 |
Cell temperature | 299 ± 2 K |
Ambient diffraction temperature | 299 ± 2 K |
Cell measurement pressure | 2100000 kPa |
Ambient diffracton pressure | 2100000 kPa |
Number of distinct elements | 4 |
Space group number | 14 |
Hermann-Mauguin space group symbol | P 1 21/c 1 |
Hall space group symbol | -P 2ybc |
Residual factor for all reflections | 0.2146 |
Residual factor for significantly intense reflections | 0.1094 |
Weighted residual factors for significantly intense reflections | 0.2902 |
Weighted residual factors for all reflections included in the refinement | 0.3538 |
Goodness-of-fit parameter for all reflections included in the refinement | 1.072 |
Diffraction radiation wavelength | 0.71073 Å |
Diffraction radiation type | MoKα |