Information card for entry 7226900
Formula |
C42 H37 N4 O16 Tb2 |
Calculated formula |
C42 H37 N4 O16 Tb2 |
Title of publication |
Syntheses, structures, color tunable and white‒light emitting lanthanide metal‒organic framework materials constructed from conjugated 1, 1'-butadiynebenzene-3, 3', 5, 5'-tetracarboxylate ligand |
Authors of publication |
Rong, Jiewei; Zhang, Wen-Wei; Bai, Junfeng |
Journal of publication |
RSC Adv. |
Year of publication |
2016 |
a |
29.9342 ± 0.0011 Å |
b |
21.16 ± 0.0007 Å |
c |
19.5148 ± 0.0007 Å |
α |
90° |
β |
93.935 ± 0.001° |
γ |
90° |
Cell volume |
12331.7 ± 0.8 Å3 |
Cell temperature |
296 ± 2 K |
Ambient diffraction temperature |
296 ± 2 K |
Number of distinct elements |
5 |
Space group number |
15 |
Hermann-Mauguin space group symbol |
C 1 2/c 1 |
Hall space group symbol |
-C 2yc |
Residual factor for all reflections |
0.0585 |
Residual factor for significantly intense reflections |
0.0508 |
Weighted residual factors for significantly intense reflections |
0.1564 |
Weighted residual factors for all reflections included in the refinement |
0.1646 |
Goodness-of-fit parameter for all reflections included in the refinement |
1.033 |
Diffraction radiation wavelength |
0.71073 Å |
Diffraction radiation type |
MoKα |
Yes |
Yes |
No |